{"text_format":"1","workbook":"xlsx","n_sheets":4,"sheets":["Main","Source","ErrorCSV","CriteriaReference"],"not_rendered":{"charts":0,"images":2,"macros":1,"external_links":0,"defined_names":4,"comments":0,"pivot_tables":0},"unopened":[],"bounds":{"document_bytes":16777216,"sheet_cells":100000,"rows_first":2000,"rows_last":500,"rows_between":2000,"halvings":0,"cell_chars":16384,"cell_head_chars":4096},"cells_cut":0,"cells_raw":0,"read":"whole","date_system":"1900"}

{"sheet":"Main","index":0,"n_rows":20,"n_cols":5,"rows_kept":20,"cut":false,"hidden":false,"merged":[[3,1,3,2],[2,1,2,2],[1,0,1,3]]}
["Mental Health Services Data Set (MHSDS) Rejection and Warning Message Summary Generator"]
["This tool provides a summary count and description of the validation errors and data quality warnings. Passing the entries from your Validation.csv file and the DataQuality.csv file (from within the SDCS Cloud Portal) into the ErrorCSV tab, and then clicking the \"Create Error List\" button, will summarise those messages."]
[]
[]
[]
[]
[]
[]
[{"$f":"CriteriaReference!B1","v":"Full summary of all validation errors"}]
[]
["Measure","Description","Construction"]
[{"$f":"INDEX(CriteriaReference!A4:A92,MATCH($A$9,CriteriaReference!$D$4:$D$92,0))","v":"N/A"},{"$f":"INDEX(CriteriaReference!B4:B92,MATCH($A$9,CriteriaReference!$D$4:$D$92,0))","v":"List of all validations"},{"$f":"INDEX(CriteriaReference!C4:C92,MATCH($A$9,CriteriaReference!$D$4:$D$92,0))","v":"List of all validations"}]
[]
["Below are a list of the rejections and warnings in the CSV file you have loaded which can impact directly on your performance against the above criteria."]
["Guidance on resolving data quality errors can be found in the SDCS Cloud data quality guidance available at:  "]
["https://digital.nhs.uk/services/strategic-data-collection-service-in-the-cloud-sdcs-cloud#user-support-and-guidance."]
["More information on the validations applied to your MHSDS submissions can be found in the MHSDS Technical Output Specification available at:"]
["https://digital.nhs.uk/data-and-information/data-collections-and-data-sets/data-sets/mental-health-services-data-set/tools-and-guidance/v5.0"]
[]
["Table","Code","Message","Additional Information","Count"]

{"sheet":"Source","index":1,"n_rows":1336,"n_cols":14,"rows_kept":1336,"cut":false,"hidden":true,"merged":[]}
["Count of entries in the ErrorCSV tab","Count","Table","Code","Message","Additional Information","Table Impacted","Rejection or warning","Criteria 1","Criteria 2","Criteria 3","Criteria 4","Criters 5","Critera 6"]
[{"$f":"COUNTA(ErrorCSV!C:C)","v":1},{"$f":"COUNTIF(ErrorCSV!C:C,Source!D2)","v":0},"MHS000Header","MHS00001","Record rejected - [M000010]DatSetVer is blank.","The DatSetVer field is a mandatory field so cannot be left blank. The value should be set to the current data set version in operation. E.g. \"6.0\" for version 6.0",{"$f":"LEFT(D2,6)","v":"MHS000"},{"$f":"IF(ISNUMBER(SEARCH(\"Rejected\",E2)),\"Rejection\",IF(ISNUMBER(SEARCH(\"Warning\",E2)),\"Warning\",\"\"))","v":"Rejection"},"N/A"]
["Count messages (to loop though) ",{"$f":"COUNTIF(ErrorCSV!C:C,Source!D3)","v":0},"MHS000Header","MHS00003","Record rejected - [M000010]DatSetVer has incorrect value for current ruling data set. [M000010]DatSetVer=<DatSetVer>","The DatSetVer field should be set to the current data set version in operation. E.g. \"6.0\" for version 6.0","MHS000","Rejection","N/A"]
[{"$f":"COUNTA(D:D)","v":1336},{"$f":"COUNTIF(ErrorCSV!C:C,Source!D4)","v":0},"MHS000Header","MHS00012","Record rejected - [M000040]PrimSystemInUse is blank.","The PrimSystemInUse is a mandatory field so cannot be left blank. This field is expecting the system you use to store your data, e.g. SystmOne, IAPTUS, Lamplight, Excel etc.","MHS000","Rejection","N/A"]
["Sum the count of messages matching",{"$f":"COUNTIF(ErrorCSV!C:C,Source!D5)","v":0},"MHS000Header","MHS00013","Record rejected - [M000040]PrimSystemInUse has an incorrect data format. [M000040]PrimSystemInUse=<PrimSystemInUse>","This is the PrimSystemInUse field. This field is expecting the system you use to store your data, e.g. SystmOne, IAPTUS, Lamplight, Excel etc. The expected format is max an20.","MHS000","Rejection","N/A"]
[{"$f":"SUM(B2:B1300)","v":0},{"$f":"COUNTIF(ErrorCSV!C:C,Source!D6)","v":0},"MHS000Header","MHS00014","Record rejected - [M000050]ReportingPeriodStartDate is blank.","The ReportingPeriodStartDate field is a mandatory field so cannot be left blank. This field is expecting to be populated with the first day of the reporting period month.","MHS000","Rejection","N/A"]
[null,{"$f":"COUNTIF(ErrorCSV!C:C,Source!D7)","v":0},"MHS000Header","MHS00015","Record rejected - [M000050]ReportingPeriodStartDate has an incorrect data format. [M000050]ReportingPeriodStartDate=<ReportingPeriodStartDate>","If REPORTING PERIOD START DATE does not match the start date of the reporting period selected by the user within Submission Portal, the file will be rejected","MHS000","Rejection","N/A"]
[null,{"$f":"COUNTIF(ErrorCSV!C:C,Source!D8)","v":0},"MHS000Header","MHS00016","Record rejected - [M000050]ReportingPeriodStartDate does not match the reporting period selected in Submission Portal upload. [M000050]ReportingPeriodStartDate=<ReportingPeriodStartDate>","This is the ReportingPeriodStartDate field. This field is expecting to be populated with the first day of the reporting period month. This date should match the reporting period selected in submission portal upload.","MHS000","Rejection","N/A"]
[null,{"$f":"COUNTIF(ErrorCSV!C:C,Source!D9)","v":0},"MHS000Header","MHS00017","Record rejected - [M000060]ReportingPeriodEndDate is blank.","The ReportingPeriodEndDate field is a mandatory field so cannot be left blank. This field is expecting to be populated with the last day of the reporting period month.","MHS000","Rejection","N/A"]
[null,{"$f":"COUNTIF(ErrorCSV!C:C,Source!D10)","v":0},"MHS000Header","MHS00018","Record rejected - [M000060]ReportingPeriodEndDate has an incorrect data format. [M000060]ReportingPeriodEndDate=<ReportingPeriodEndDate>","This is the ReportingPeriodEndDate field. This field is expecting to be populated with the last day of the reporting period month. The data dictionary specification for date formats is an10 CCYY-MM-DD. More information regarding date formats can be found in the Technical Output Specifical, Technical Glossary tab. You can use the calendar to select the date, this may be easier and less prone to error than inputting this manually.","MHS000","Rejection","N/A"]
[null,{"$f":"COUNTIF(ErrorCSV!C:C,Source!D11)","v":0},"MHS000Header","MHS00019","Record rejected - [M000060]ReportingPeriodEndDate does not match the reporting period selected in Submission Portal upload. [M000060]ReportingPeriodEndDate=<ReportingPeriodEndDate>","This is the ReportingPeriodEndDate field. This field is expecting to be populated with the last day of the reporting period month. This date should match the reporting period selected in submission portal upload.","MHS000","Rejection","N/A"]
[null,{"$f":"COUNTIF(ErrorCSV!C:C,Source!D12)","v":0},"MHS000Header","MHS00020","Record rejected - [M000070]DateTimeDatSetCreate is blank.","The DateTimeDatSetCreate field is a mandatory field so cannot be left blank. This field is expecting to be populated with the date that the database was created (may be today's date) and does not need to include the time. You can use the calendar to select the date, this may be easier and less prone to error than inputting this manually.","MHS000","Rejection","N/A"]
[null,{"$f":"COUNTIF(ErrorCSV!C:C,Source!D13)","v":0},"MHS000Header","MHS00021","Record rejected - [M000070]DateTimeDatSetCreate has an incorrect data format. [M000070]DateTimeDatSetCreate=<DateTimeDatSetCreate>","This is the DateTimeDatSetCreate field. This field is expecting to be populated with the date that the database was created (may be today's date) and does not need to include the time. The data dictionary specification for date formats is an10 CCYY-MM-DD. The format for Date/Time fields is an19 CCYY-MM-DDTHH:MM:SS. More information regarding date formats can be found in the Technical Output Specifical, Technical Glossary tab. You can use the calendar to select the date, this may be easier and less prone to error than inputting this manually. You can use the calendar to select the date, this may be easier and less prone to error than inputting this manually.","MHS000","Rejection","N/A"]
[null,{"$f":"COUNTIF(ErrorCSV!C:C,Source!D14)","v":0},"MHS000Header","MHS00025","Group rejected - More than one [MHS000]Header submitted for this submission file.","Group-level Validation:  If more than one MHS000 provided, all duplicated records (and hence the submission file) will be rejected.  The submission file will be rejected if the MHS000 is missing from a submission.  The submission file will also be rejected if any of the record level rejections contained within this table are generated.","MHS000","Rejection","N/A"]
[null,{"$f":"COUNTIF(ErrorCSV!C:C,Source!D15)","v":0},"MHS000Header","MHS00027","Record rejected - [M000070]DateTimeDatSetCreate is after the Upload Date in the Submission Portal. [M000070]DateTimeDatSetCreate=<DateTimeDatSetCreate>","This is the DateTimeDatSetCreate field. This field is expecting to be populated with the date that the database was created (may be today's date) and does not need to include the time. This should be populated with a date that is after the ReportingPeriodEndDate but not after the Upload Date.","MHS000","Rejection","N/A"]
[null,{"$f":"COUNTIF(ErrorCSV!C:C,Source!D16)","v":0},"MHS000Header","MHS00028","Record rejected - [M000080]OrgIDProvider is blank.","The OrgIDProvider field is a mandatory field so cannot be left blank. This is the Organisation Identifier (ODS code) of the Organisation acting as a Health Care Provider.","MHS000","Rejection","N/A"]
[null,{"$f":"COUNTIF(ErrorCSV!C:C,Source!D17)","v":0},"MHS000Header","MHS00029","Record rejected - [M000080]OrgIDProvider has an incorrect data format. [M000080]OrgIDProvider=<OrgIDProvider>","This is the OrgIDProvider field and is expecting to be populated with the Organisation Identifier (ODS code) of the Organisation acting as a Health Care Provider. The expected format is min an3 max an6. ","MHS000","Rejection","N/A"]
[null,{"$f":"COUNTIF(ErrorCSV!C:C,Source!D18)","v":0},"MHS000Header","MHS00030","Record rejected - [M000080]OrgIDProvider does not match the Organisation Identifier from the Submission Portal login details. [M000080]OrgIDProvider=<OrgIDProvider>","This is the OrgIDProvider field and is expecting to be populated with the Organisation Identifier (ODS code) of the Organisation acting as a Health Care Provider. This code should match the Organisation code from the submission portal login details.","MHS000","Rejection","N/A"]
[null,{"$f":"COUNTIF(ErrorCSV!C:C,Source!D19)","v":0},"MHS000Header","MHS00031","Record rejected - [M000090]OrgIDSubmit is blank.","The OrgIDSubmit field is a mandatory field so cannot be left blank. This field is expecting the Organisation Identifier (ODS code) of the Organisation acting as the physical sender of a Data Set submission. Unless there is an agreement for a third party to submit the data, this will be the same as the OrgIDProvider.","MHS000","Rejection","N/A"]
[null,{"$f":"COUNTIF(ErrorCSV!C:C,Source!D20)","v":0},"MHS000Header","MHS00032","Record rejected - [M000090]OrgIDSubmit has an incorrect data format. [M000090]OrgIDSubmit=<OrgIDSubmit>","This is the OrgIDSubmit field and is expecting to be populated with the Organisation Identifier (ODS code) of the Organisation acting as the physical sender of a Data Set submission. Unless there is an agreement for a third party to submit the data, this will be the same as the OrgIDProvider. The expected format is min an3 max an6. ","MHS000","Rejection","N/A"]
[null,{"$f":"COUNTIF(ErrorCSV!C:C,Source!D21)","v":0},"MHS000Header","MHS00033","Warning - [M000090]OrgIDSubmit does not match the Organisation Identifier from the Submission Portal login details. [M000090]OrgIDSubmit=<OrgIDSubmit>","The OrgIDSubmit field is a mandatory field so cannot be left blank. This field is expecting the Organisation Identifier (ODS code) of the Organisation acting as the physical sender of a Data Set submission. It is possible that the OrgIDSubmit field is different to the OrgIDProvider as this is the Org Code of the organisation using the portal to send the data. Usually however we normally see this populated with the same value as the OrgIDProvider field.","MHS000","Warning","N/A"]
[null,{"$f":"COUNTIF(ErrorCSV!C:C,Source!D22)","v":0},"MHS000Header","MHS00034","Warning - [M000090]OrgIDSubmit is not for a current live organisation in national tables. [M000090]OrgIDSubmit=<OrgIDSubmit>","The OrgIDSubmit field is a mandatory field so cannot be left blank. This field is expecting the Organisation Identifier (ODS code) of the Organisation acting as the physical sender of a Data Set submission. The ODS code provided is not recognised as being live. You can search for the Organisation on the ODS portal: https://odsportal.digital.nhs.uk/. It is possible that the OrgIDSubmit field is different to the OrgIDProvider as this is the Org Code of the organisation using the portal to send the data. Usually however we normally see this populated with the same value as the OrgIDProviderider field.","MHS000","Warning","N/A"]
[null,{"$f":"COUNTIF(ErrorCSV!C:C,Source!D23)","v":0},"MHS000Header","MHS00035","Record rejected - [M000080]OrgIDProvider is for an organisation that was not live in national tables at any point during the reporting period. [M000080]OrgIDProvider=<OrgIDProvider>","This is the OrgIDProvider field and is expecting to be populated with the Organisation Identifier (ODS code) of the Organisation acting as a Health Care Provider. The ODS code provided is not recognised as being live for the duration of the reporting period. You can search for your Organisation on the ODS portal: https://odsportal.digital.nhs.uk/.","MHS000","Rejection","N/A"]
[null,{"$f":"COUNTIF(ErrorCSV!C:C,Source!D24)","v":0},"MHS000Header","MHS00036","Record rejected - [M000070]DateTimeDatSetCreate is before the [M000050]ReportingPeriodStartDate. [M000070]DateTimeDatSetCreate=<DateTimeDatSetCreate> [M000050]ReportingPeriodStartDate=<ReportingPeriodStartDate>","This is the DateTimeDatSetCreate field. This field is expecting to be populated with the date that the database was created (may be today's date) and does not need to include the time. This should be populated with a date that is after the ReportingPeriodEndDate but not after the Upload Date.","MHS000","Rejection","N/A"]
[null,{"$f":"COUNTIF(ErrorCSV!C:C,Source!D25)","v":0},"MHS000Header","MHS00037","Record rejected - [M000070]DateTimeDatSetCreate is before the [M000060]ReportingPeriodEndDate. [M000070]DateTimeDatSetCreate=<DateTimeDatSetCreate> [M000060]ReportingPeriodEndDate=<ReportingPeriodEndDate>","This is the DateTimeDatSetCreate field. This field is expecting to be populated with the date that the database was created (may be today's date) and does not need to include the time. This should be populated with a date that is after the ReportingPeriodEndDate but not after the Upload Date.","MHS000","Rejection","N/A"]
[null,{"$f":"COUNTIF(ErrorCSV!C:C,Source!D26)","v":0},"MHS000Header","MHS00038","Record rejected - [M000010]DatSetVer has an incorrect data format. [M000010]DatSetVer=<DatSetVer>","This is the DateTimeDatSetCreate field - this should be entered as 6.0","MHS000","Rejection","N/A","N/A","N/A","N/A","N/A","N/A"]
[null,{"$f":"COUNTIF(ErrorCSV!C:C,Source!D27)","v":0},"MHS001MPI","MHS00101","Record rejected - Local Patient Identifier (Extended) is blank.","The LocalPatientId field is a mandatory field so cannot be left blank. The LocalPatientId provides a link between records in the MHS001MPI table, associated referrals and all non-referral-based data associated with the Patient. To avoid the incorrect linkage of records the LocalPatientId must not be reused i.e. it should only ever relate to one Patient. This ensures that data relating to more than one Patient does not get incorrectly identified as belonging to a single Patient in MHSDS.","MHS001","Rejection","N/A","CYP Access","OAPs","IPS","EIP","CYPED"]
[null,{"$f":"COUNTIF(ErrorCSV!C:C,Source!D28)","v":0},"MHS001MPI","MHS00102","Record rejected - Local Patient Identifier (Extended) has an incorrect data format.","The LocalPatientId field can accept up to 20 characters.","MHS001","Rejection","N/A","CYP Access","OAPs","IPS","EIP","CYPED"]
[null,{"$f":"COUNTIF(ErrorCSV!C:C,Source!D29)","v":0},"MHS001MPI","MHS00103","Record rejected - [M001901]LocalPatientID is blank. [M001040]NHSNumber=<NHSNumber>","The LocalPatientId field is mandatory - it must be entered and can accept up to 20 characters.","MHS001","Rejection","N/A","N/A","N/A","N/A","N/A","N/A"]
[null,{"$f":"COUNTIF(ErrorCSV!C:C,Source!D30)","v":0},"MHS001MPI","MHS00104","Record rejected - [M001901]LocalPatientID has an incorrect data format. [M001901]LocalPatientID=<LocalPatientID>","The LocalPatientId field is mandatory - it must be entered and can accept up to 20 characters.","MHS001","Rejection","N/A","N/A","N/A","N/A","N/A","N/A"]
{"$rows_left_out":1307}
{"sheet":"ErrorCSV","index":2,"n_rows":1,"n_cols":25,"rows_kept":1,"cut":false,"hidden":false,"merged":[]}
["REPORT_TYPE","DESCRIPTION","CODE","NUMERATOR","DENOMINATOR","DATA_ITEM1","DATA_VALUE1","DATA_ITEM2","DATA_VALUE2","DATA_ITEM3","DATA_VALUE3","DATA_ITEM4","DATA_VALUE4","DATA_ITEM5","DATA_VALUE5","DATA_ITEM6","DATA_VALUE6","DATA_ITEM7","DATA_VALUE7","DATA_ITEM8","DATA_VALUE8","DATA_ITEM9","DATA_VALUE9","DATA_ITEM10","DATA_VALUE10"]

{"sheet":"CriteriaReference","index":3,"n_rows":9,"n_cols":4,"rows_kept":9,"cut":false,"hidden":true,"merged":[]}
["Selected:","Full summary of all validation errors",{"$f":"INDEX(A:A,MATCH(B1,D:D,0))","v":"N/A"}]
[]
["Measure Name","Description","Construction","Title"]
["N/A","List of all validations","List of all validations","Full summary of all validation errors"]
["CYP Access","A list of validations which impact CYP Access measures. NHS Digital currently publishes two access measures for Children and Young People; a two-contact measure and a one-contact measure:\n\nMHS69 – The number of CYP receiving at least two contacts, where their first contact occurs before their 18th birthday\n\nMHS95 – The number of CYP aged under 18 with at least one contact in a 12-month rolling period\n\nThese are published in the MHSDS monthly publication.","Due to the complex construction of this measure, we have provided the SQL script used to produce the output in the MHSDS monthly metadata file (available to download from https://digital.nhs.uk/data-and-information/data-collections-and-data-sets/data-sets/mental-health-services-data-set/statistics-and-reports). More information about what MHSDS fields are required for these measures to be reported accurately can be found in our Quick guide to submitting Children and Young People (CYP) Access measures: https://digital.nhs.uk/data-and-information/data-collections-and-data-sets/data-sets/mental-health-services-data-set/submit-data/quick-guide-to-submitting-children-and-young-people-cyp-access-measures","CYP Access Measures"]
["OAPs","A list of validations which impact the accurate recording of Out of Area Placements (OAPs) within MHSDS.","More information about what MHSDS fields are required for OAPs to be reported accurately within MHSDS can be found in our Quick guide to submitting Out of Area Placements (OAPs): https://digital.nhs.uk/data-and-information/data-collections-and-data-sets/data-sets/mental-health-services-data-set/submit-data/quick-guide-to-submitting-out-of-area-placements-oaps","Out of Area Placements (OAPs)"]
["IPS","A list of validations which impact the accurate recording of Individual Placement and Support (IPS) within MHSDS.","More information about what MHSDS fields are required for IPS to be reported accurately within MHSDS can be found on the NHS Futures website: https://future.nhs.uk/IPSWorkspace/groupHome","Indiviudal Placement and Support (IPS)"]
["EIP","A list of validations which impact EIP measures. NHS Digital currently publishes the following EIP measures:\nEIP01\nEIP23\nEIP32\nEIP63\nEIP64\nEIP65\nEIP66\nEIP67\nEIP68\nEIP69\nThese are published in the MHSDS monthly publication.","The contruction of these measures can be found in the MHSDS monthly metadata file (available to download from https://digital.nhs.uk/data-and-information/data-collections-and-data-sets/data-sets/mental-health-services-data-set/statistics-and-reports). More information about what MHSDS fields are required for EIP measures to be reported accurately within MHSDS can be found in our Quick guide to submitting Early Intervention in Psychosis (EIP) Waiting Times: https://digital.nhs.uk/data-and-information/data-collections-and-data-sets/data-sets/mental-health-services-data-set/submit-data/quick-guide-to-submitting-out-of-area-placements-oaps","Early Intervention in Psychosis (EIP) "]
["CYPED","A list of validations which impact CYPED measures. NHS Digital currently publishes the following CYPED measures:\nED85\nED86\nED87\nED88\nED89\nThese are published in the MHSDS monthly publication.","The contruction of these measures can be found in the MHSDS monthly metadata file (available to download from https://digital.nhs.uk/data-and-information/data-collections-and-data-sets/data-sets/mental-health-services-data-set/statistics-and-reports). More information about what MHSDS fields are required for CYPED measures to be reported accurately within MHSDS can be found in our Quick guide to submitting Children and Young People with Eating Disorders (CYP ED) Waiting Times: https://digital.nhs.uk/data-and-information/data-collections-and-data-sets/data-sets/mental-health-services-data-set/submit-data/quick-guide-to-submitting-children-and-young-people-with-eating-disorders-cyp-ed-waiting-times ","Children and Young People with Eating Disorders (CYP ED)"]