{"text_format":"1","workbook":"xlsx","n_sheets":7,"sheets":["Version Control","ErrorCSV","Main","Log","ErrorSummary","ErrorReference","CriteriaReference"],"not_rendered":{"charts":0,"images":1,"macros":1,"external_links":0,"defined_names":2,"comments":0,"pivot_tables":0},"unopened":[],"bounds":{"document_bytes":16777216,"sheet_cells":100000,"rows_first":2000,"rows_last":500,"rows_between":2000,"halvings":0,"cell_chars":16384,"cell_head_chars":4096},"cells_cut":0,"cells_raw":0,"read":"whole","date_system":"1900"}

{"sheet":"Version Control","index":0,"n_rows":10,"n_cols":3,"rows_kept":10,"cut":false,"hidden":false,"merged":[[3,0,4,0],[3,1,4,1],[3,2,4,3],[5,2,5,3],[7,2,7,3],[6,2,6,3]]}
["Version control"]
[]
[]
["Version","Date Issued","Summary Of Changes"]
[]
["1.0","13/09/2021","Initial launch"]
["1.1","30/09/2021","Added log function\nAdded Version control tab\n"]
["1.2","10/07/2023","Updated to reference CNST year 5 requirements\n"]
[]
["Copyright © 2023, NHS England"]
{"$rows_left_out":1}
{"sheet":"ErrorCSV","index":1,"n_rows":1,"n_cols":25,"rows_kept":1,"cut":false,"hidden":false,"merged":[]}
["REPORT_TYPE","DESCRIPTION","CODE","NUMERATOR","DENOMINATOR","DATA_ITEM1","DATA_VALUE1","DATA_ITEM2","DATA_VALUE2","DATA_ITEM3","DATA_VALUE3","DATA_ITEM4","DATA_VALUE4","DATA_ITEM5","DATA_VALUE5","DATA_ITEM6","DATA_VALUE6","DATA_ITEM7","DATA_VALUE7","DATA_ITEM8","DATA_VALUE8","DATA_ITEM9","DATA_VALUE9","DATA_ITEM10","DATA_VALUE10"]

{"sheet":"Main","index":2,"n_rows":27,"n_cols":5,"rows_kept":27,"cut":false,"hidden":false,"merged":[[3,1,3,7],[7,1,7,9]]}
[null,"Maternity Services Data Set (MSDS) Rejection and Warning Summary Generator"]
[]
[null,"Version 1.2"]
[null,"This tool provides a summary count of validation errors in order to quickly show common data quality issues.\nIt also allows the user to focus on data quality issues that may impact upon the various metrics being measured as part of the Clinical Negligence Scheme for Trusts (CNST)."]
[]
[]
[null,"Instructions:"]
[null,"Please make sure you “Enable content” if prompted. \nInsert your MSDS data validation report onto the ‘ErrorCSV’ tab. Switch to the ‘Main’ tab and click the 'Create Error List' button.\nUse the drop-down menu to select a particular measure or to view a full summary of your validation errors. "]
[]
[]
{"$rows_left_out":18}
{"sheet":"Log","index":3,"n_rows":4,"n_cols":5,"rows_kept":4,"cut":false,"hidden":false,"merged":[]}
[]
[]
[null,null,null,"Log use details"]
[null,null,null,"Date","CSV lines"]

{"sheet":"ErrorSummary","index":4,"n_rows":51,"n_cols":19,"rows_kept":51,"cut":false,"hidden":true,"merged":[]}
[]
[]
[]
[]
[null,null,{"$f":"COUNTIFS(ErrorCSV!B:B,ErrorSummary!A5,ErrorCSV!C:C,ErrorSummary!B5)","v":0},{"$f":"IFERROR(VLOOKUP(B5&\" - \"&A5,ErrorReference!A:C,3,FALSE),\"\")","v":""},"Criteria 1","Criteria 2","Criteria 3","Criteria 4","Criteria 5","Criteria 6","Criteria 7","Criteria 8","Criteria 9","Criteria 10","Criteria 11","Crtieria 12","Criteria 13","Criteria 14","Criteria 15"]
[1,1,{"$f":"COUNTIFS(ErrorCSV!B:B,ErrorSummary!A6,ErrorCSV!C:C,ErrorSummary!B6)","v":0},{"$f":"IFERROR(VLOOKUP(B6&\" - \"&A6,ErrorReference!A:C,3,FALSE),\"\")","v":""},{"$f":"IFERROR(VLOOKUP(B6&\" - \"&A6,ErrorReference!A:R,4,FALSE),\"\")","v":""},{"$f":"IFERROR(VLOOKUP(B6&\" - \"&A6,ErrorReference!A:R,5,FALSE),\"\")","v":""},{"$f":"IFERROR(VLOOKUP(B6&\" - \"&A6,ErrorReference!A:R,6,FALSE),\"\")","v":""},{"$f":"IFERROR(VLOOKUP(B6&\" - \"&A6,ErrorReference!A:R,7,FALSE),\"\")","v":""},{"$f":"IFERROR(VLOOKUP(B6&\" - \"&A6,ErrorReference!A:R,8,FALSE),\"\")","v":""},{"$f":"IFERROR(VLOOKUP(B6&\" - \"&A6,ErrorReference!A:R,9,FALSE),\"\")","v":""},{"$f":"IFERROR(VLOOKUP(B6&\" - \"&A6,ErrorReference!A:R,10,FALSE),\"\")","v":""},{"$f":"IFERROR(VLOOKUP(B6&\" - \"&A6,ErrorReference!A:R,11,FALSE),\"\")","v":""},{"$f":"IFERROR(VLOOKUP(B6&\" - \"&A6,ErrorReference!A:R,12,FALSE),\"\")","v":""},{"$f":"IFERROR(VLOOKUP(B6&\" - \"&A6,ErrorReference!A:R,13,FALSE),\"\")","v":""},{"$f":"IFERROR(VLOOKUP(B6&\" - \"&A6,ErrorReference!A:R,14,FALSE),\"\")","v":""},{"$f":"IFERROR(VLOOKUP(B6&\" - \"&A6,ErrorReference!A:R,15,FALSE),\"\")","v":""},{"$f":"IFERROR(VLOOKUP(B6&\" - \"&A6,ErrorReference!A:R,16,FALSE),\"\")","v":""},{"$f":"IFERROR(VLOOKUP(B6&\" - \"&A6,ErrorReference!A:R,17,FALSE),\"\")","v":""},{"$f":"IFERROR(VLOOKUP(B6&\" - \"&A6,ErrorReference!A:R,18,FALSE),\"\")","v":""}]
[null,null,{"$f":"COUNTIFS(ErrorCSV!B:B,ErrorSummary!A7,ErrorCSV!C:C,ErrorSummary!B7)","v":0},{"$f":"IFERROR(VLOOKUP(B7&\" - \"&A7,ErrorReference!A:C,3,FALSE),\"\")","v":""},{"$f":"IFERROR(VLOOKUP(B7&\" - \"&A7,ErrorReference!A:R,4,FALSE),\"\")","v":""},{"$f":"IFERROR(VLOOKUP(B7&\" - \"&A7,ErrorReference!A:R,5,FALSE),\"\")","v":""},{"$f":"IFERROR(VLOOKUP(B7&\" - \"&A7,ErrorReference!A:R,6,FALSE),\"\")","v":""},{"$f":"IFERROR(VLOOKUP(B7&\" - \"&A7,ErrorReference!A:R,7,FALSE),\"\")","v":""},{"$f":"IFERROR(VLOOKUP(B7&\" - \"&A7,ErrorReference!A:R,8,FALSE),\"\")","v":""},{"$f":"IFERROR(VLOOKUP(B7&\" - \"&A7,ErrorReference!A:R,9,FALSE),\"\")","v":""},{"$f":"IFERROR(VLOOKUP(B7&\" - \"&A7,ErrorReference!A:R,10,FALSE),\"\")","v":""},{"$f":"IFERROR(VLOOKUP(B7&\" - \"&A7,ErrorReference!A:R,11,FALSE),\"\")","v":""},{"$f":"IFERROR(VLOOKUP(B7&\" - \"&A7,ErrorReference!A:R,12,FALSE),\"\")","v":""},{"$f":"IFERROR(VLOOKUP(B7&\" - \"&A7,ErrorReference!A:R,13,FALSE),\"\")","v":""},{"$f":"IFERROR(VLOOKUP(B7&\" - \"&A7,ErrorReference!A:R,14,FALSE),\"\")","v":""},{"$f":"IFERROR(VLOOKUP(B7&\" - \"&A7,ErrorReference!A:R,15,FALSE),\"\")","v":""},{"$f":"IFERROR(VLOOKUP(B7&\" - \"&A7,ErrorReference!A:R,16,FALSE),\"\")","v":""},{"$f":"IFERROR(VLOOKUP(B7&\" - \"&A7,ErrorReference!A:R,17,FALSE),\"\")","v":""},{"$f":"IFERROR(VLOOKUP(B7&\" - \"&A7,ErrorReference!A:R,18,FALSE),\"\")","v":""}]
[null,null,null,null,{"$f":"IFERROR(VLOOKUP(B8&\" - \"&A8,ErrorReference!A:R,4,FALSE),\"\")","v":""},{"$f":"IFERROR(VLOOKUP(B8&\" - \"&A8,ErrorReference!A:R,5,FALSE),\"\")","v":""},{"$f":"IFERROR(VLOOKUP(B8&\" - \"&A8,ErrorReference!A:R,6,FALSE),\"\")","v":""},{"$f":"IFERROR(VLOOKUP(B8&\" - \"&A8,ErrorReference!A:R,7,FALSE),\"\")","v":""},{"$f":"IFERROR(VLOOKUP(B8&\" - \"&A8,ErrorReference!A:R,8,FALSE),\"\")","v":""},{"$f":"IFERROR(VLOOKUP(B8&\" - \"&A8,ErrorReference!A:R,9,FALSE),\"\")","v":""},{"$f":"IFERROR(VLOOKUP(B8&\" - \"&A8,ErrorReference!A:R,10,FALSE),\"\")","v":""},{"$f":"IFERROR(VLOOKUP(B8&\" - \"&A8,ErrorReference!A:R,11,FALSE),\"\")","v":""},{"$f":"IFERROR(VLOOKUP(B8&\" - \"&A8,ErrorReference!A:R,12,FALSE),\"\")","v":""},{"$f":"IFERROR(VLOOKUP(B8&\" - \"&A8,ErrorReference!A:R,13,FALSE),\"\")","v":""},{"$f":"IFERROR(VLOOKUP(B8&\" - \"&A8,ErrorReference!A:R,14,FALSE),\"\")","v":""},{"$f":"IFERROR(VLOOKUP(B8&\" - \"&A8,ErrorReference!A:R,15,FALSE),\"\")","v":""},{"$f":"IFERROR(VLOOKUP(B8&\" - \"&A8,ErrorReference!A:R,16,FALSE),\"\")","v":""},{"$f":"IFERROR(VLOOKUP(B8&\" - \"&A8,ErrorReference!A:R,17,FALSE),\"\")","v":""},{"$f":"IFERROR(VLOOKUP(B8&\" - \"&A8,ErrorReference!A:R,18,FALSE),\"\")","v":""}]
[null,null,null,null,{"$f":"IFERROR(VLOOKUP(B9&\" - \"&A9,ErrorReference!A:R,4,FALSE),\"\")","v":""},{"$f":"IFERROR(VLOOKUP(B9&\" - \"&A9,ErrorReference!A:R,5,FALSE),\"\")","v":""},{"$f":"IFERROR(VLOOKUP(B9&\" - \"&A9,ErrorReference!A:R,6,FALSE),\"\")","v":""},{"$f":"IFERROR(VLOOKUP(B9&\" - \"&A9,ErrorReference!A:R,7,FALSE),\"\")","v":""},{"$f":"IFERROR(VLOOKUP(B9&\" - \"&A9,ErrorReference!A:R,8,FALSE),\"\")","v":""},{"$f":"IFERROR(VLOOKUP(B9&\" - \"&A9,ErrorReference!A:R,9,FALSE),\"\")","v":""},{"$f":"IFERROR(VLOOKUP(B9&\" - \"&A9,ErrorReference!A:R,10,FALSE),\"\")","v":""},{"$f":"IFERROR(VLOOKUP(B9&\" - \"&A9,ErrorReference!A:R,11,FALSE),\"\")","v":""},{"$f":"IFERROR(VLOOKUP(B9&\" - \"&A9,ErrorReference!A:R,12,FALSE),\"\")","v":""},{"$f":"IFERROR(VLOOKUP(B9&\" - \"&A9,ErrorReference!A:R,13,FALSE),\"\")","v":""},{"$f":"IFERROR(VLOOKUP(B9&\" - \"&A9,ErrorReference!A:R,14,FALSE),\"\")","v":""},{"$f":"IFERROR(VLOOKUP(B9&\" - \"&A9,ErrorReference!A:R,15,FALSE),\"\")","v":""},{"$f":"IFERROR(VLOOKUP(B9&\" - \"&A9,ErrorReference!A:R,16,FALSE),\"\")","v":""},{"$f":"IFERROR(VLOOKUP(B9&\" - \"&A9,ErrorReference!A:R,17,FALSE),\"\")","v":""},{"$f":"IFERROR(VLOOKUP(B9&\" - \"&A9,ErrorReference!A:R,18,FALSE),\"\")","v":""}]
[null,null,null,null,{"$f":"IFERROR(VLOOKUP(B10&\" - \"&A10,ErrorReference!A:R,4,FALSE),\"\")","v":""},{"$f":"IFERROR(VLOOKUP(B10&\" - \"&A10,ErrorReference!A:R,5,FALSE),\"\")","v":""},{"$f":"IFERROR(VLOOKUP(B10&\" - \"&A10,ErrorReference!A:R,6,FALSE),\"\")","v":""},{"$f":"IFERROR(VLOOKUP(B10&\" - \"&A10,ErrorReference!A:R,7,FALSE),\"\")","v":""},{"$f":"IFERROR(VLOOKUP(B10&\" - \"&A10,ErrorReference!A:R,8,FALSE),\"\")","v":""},{"$f":"IFERROR(VLOOKUP(B10&\" - \"&A10,ErrorReference!A:R,9,FALSE),\"\")","v":""},{"$f":"IFERROR(VLOOKUP(B10&\" - \"&A10,ErrorReference!A:R,10,FALSE),\"\")","v":""},{"$f":"IFERROR(VLOOKUP(B10&\" - \"&A10,ErrorReference!A:R,11,FALSE),\"\")","v":""},{"$f":"IFERROR(VLOOKUP(B10&\" - \"&A10,ErrorReference!A:R,12,FALSE),\"\")","v":""},{"$f":"IFERROR(VLOOKUP(B10&\" - \"&A10,ErrorReference!A:R,13,FALSE),\"\")","v":""},{"$f":"IFERROR(VLOOKUP(B10&\" - \"&A10,ErrorReference!A:R,14,FALSE),\"\")","v":""},{"$f":"IFERROR(VLOOKUP(B10&\" - \"&A10,ErrorReference!A:R,15,FALSE),\"\")","v":""},{"$f":"IFERROR(VLOOKUP(B10&\" - \"&A10,ErrorReference!A:R,16,FALSE),\"\")","v":""},{"$f":"IFERROR(VLOOKUP(B10&\" - \"&A10,ErrorReference!A:R,17,FALSE),\"\")","v":""},{"$f":"IFERROR(VLOOKUP(B10&\" - \"&A10,ErrorReference!A:R,18,FALSE),\"\")","v":""}]
{"$rows_left_out":42}
{"sheet":"ErrorReference","index":5,"n_rows":77,"n_cols":18,"rows_kept":77,"cut":false,"hidden":true,"merged":[]}
["Reference","Current Message","Additional information","Criteria 1","Criteria 2","Criteria 3","Criteria 4","Criteria 5","Criteria 6","Criteria 7","Criteria 8","Criteria 9","Criteria 10","Criteria 11","Criteria 12","Criteria 13","Criteria 14","Criteria 15"]
["MSD0011 - Group rejected - No valid MSD101 group transmitted for this LOCAL PATIENT IDENTIFIER (EXTENDED (MOTHER)).","MSD0011 - Group rejected - No valid MSD101 group transmitted for this LOCAL PATIENT IDENTIFIER (EXTENDED (MOTHER)). M001901 LOCAL PATIENT IDENTIFIER (EXTENDED (MOTHER))=<LPIDMother>","Record in the MSD001 table rejected because there is no corresponding record in the MSD101 table. There are two possible reasons why this message is presented. 1: The corresponding record in the linked table (MSD101) has been rejected due to a validation error. 2: There is no corresponding record in the linked table (MSD101).",2.1,2.2000000000000002,2.2999999999999998,2.4,2.5,2.6,2.7,2.8,2.9,2.1,2.11,3,4,5.0999999999999996,5.2]
["MSD0012 - Group rejected - No valid MSD002 group transmitted for this LOCAL PATIENT IDENTIFIER (EXTENDED (MOTHER)).","MSD0012 - Group rejected - No valid MSD002 group transmitted for this LOCAL PATIENT IDENTIFIER (EXTENDED (MOTHER)). M001901 LOCAL PATIENT IDENTIFIER (EXTENDED (MOTHER))=<LPIDMother>","Record in the MSD001 table rejected because there is no corresponding record in the MSD002 table. There are two possible reasons why this message is presented. 1: The corresponding record in the linked table (MSD002) has been rejected due to a validation error. 2: There is no corresponding record in the linked table (MSD002).",2.1,2.2000000000000002,2.2999999999999998,2.4,2.5,2.6,2.7,2.8,2.9,2.1,2.11,3,4,5.0999999999999996,5.2]
["MSD1011 - Group rejected - No valid MSD001 group transmitted for this LOCAL PATIENT IDENTIFIER (EXTENDED (MOTHER)).","MSD1011 - Group rejected - No valid MSD001 group transmitted for this LOCAL PATIENT IDENTIFIER (EXTENDED (MOTHER)). M101901 LOCAL PATIENT IDENTIFIER (EXTENDED (MOTHER))=<LPIDMother>","Record in the MSD101 table rejected because there is no corresponding record in the MSD001 table. There are two possible reasons why this message is presented. 1: The corresponding record in the linked table (MSD001) has been rejected due to a validation error. 2: There is no corresponding record in the linked table (MSD001).",2.1,2.2000000000000002,2.2999999999999998,2.4,2.5,2.6,2.7,2.8,2.9,2.1,2.11,3,4,5.0999999999999996,5.2]
["MSD1012 - Group rejected - More than one MSD101 groups transmitted for this PREGNANCY IDENTIFIER.","MSD1012 - Group rejected - More than one MSD101 groups transmitted for this PREGNANCY IDENTIFIER. M101902 PREGNANCY IDENTIFIER=<PregnancyID>",null,2.1,2.2000000000000002,2.2999999999999998,2.4,2.5,2.6,2.7,2.8,2.9,2.1,2.11,3,4,5.0999999999999996,5.2]
["MSD2011 - Group rejected - No valid MSD101 group transmitted for this PREGNANCY IDENTIFIER.","MSD2011 - Group rejected - No valid MSD101 group transmitted for this PREGNANCY IDENTIFIER. M201902 PREGNANCY IDENTIFIER=<PregnancyID>","Record in the MSD201 table rejected because there is no corresponding record in the MSD101 table. There are two possible reasons why this message is presented. 1: The corresponding record in the linked table (MSD101) has been rejected due to a validation error. 2: There is no corresponding record in the linked table (MSD101).",2.1,2.2000000000000002,2.2999999999999998,2.4,2.5,2.6,2.7,2.9,2.1,2.11,3]
["MSD2012 - Group rejected - More than one MSD201 groups transmitted for this CARE CONTACT IDENTIFIER.","MSD2012 - Group rejected - More than one MSD201 groups transmitted for this CARE CONTACT IDENTIFIER. M201903 CARE CONTACT IDENTIFIER=<CareConID>",null,2.1,2.2000000000000002,2.2999999999999998,2.4,2.5,2.6,2.7,2.9,2.1,2.11,3]
["MSD2021 - Group rejected - No valid MSD201 group transmitted for this CARE CONTACT IDENTIFIER.","MSD2021 - Group rejected - No valid MSD201 group transmitted for this CARE CONTACT IDENTIFIER. M202903 CARE CONTACT IDENTIFIER=<CareConID>","Record in the MSD202 table rejected because there is no corresponding record in the MSD201 table. There are two possible reasons why this message is presented. 1: The corresponding record in the linked table (MSD201) has been rejected due to a validation error. 2: There is no corresponding record in the linked table (MSD201).",3]
["MSD2022 - Group rejected - More than one MSD202 groups transmitted for this CARE ACTIVITY IDENTIFIER (MOTHER).","MSD2022 - Group rejected - More than one MSD202 groups transmitted for this CARE ACTIVITY IDENTIFIER (MOTHER). M202904 CARE ACTIVITY IDENTIFIER (MOTHER)=<CareActIDMother>B1:B9",null,3]
["MSD3011 - Group rejected - No valid MSD101 group transmitted for this PREGNANCY IDENTIFIER.","MSD3011 - Group rejected - No valid MSD101 group transmitted for this PREGNANCY IDENTIFIER. M301902 PREGNANCY IDENTIFIER=<PregnancyID>","Record in the MSD301 table rejected because there is no corresponding record in the MSD101 table. There are two possible reasons why this message is presented. 1: The corresponding record in the linked table (MSD101) has been rejected due to a validation error. 2: There is no corresponding record in the linked table (MSD101).",2.1,2.2000000000000002,2.2999999999999998,2.4,2.5,2.6,2.7,2.9,2.1,2.11]
{"$rows_left_out":68}
{"sheet":"CriteriaReference","index":6,"n_rows":18,"n_cols":4,"rows_kept":18,"cut":false,"hidden":true,"merged":[]}
[1,{"$f":"INDEX(A3:A18,A1)","v":99}]
["Criteria","Standard","Construction","Title"]
[99,"List All","List All","Full summary of all validation errors"]
[2.1,"Trust Boards to assure themselves that at least 10 out of 11 Clinical Quality Improvement Metrics (CQIMs) have passed the associated data quality criteria on the national Maternity Services Dashboard for data submissions relating to activity in July 2023. ","CQIMDQ14\nCQIMDQ15\nCQIMDQ16\nCQIMDQ24\nSee metadata file for full construction.","CQIMApgar"]
[2.2000000000000002,"Trust Boards to assure themselves that at least 10 out of 11 Clinical Quality Improvement Metrics (CQIMs) have passed the associated data quality criteria on the national Maternity Services Dashboard for data submissions relating to activity in July 2023. ","CQIMDQ08\nCQIMDQ09\nSee metadata file for full construction","CQIMBreastfeeding"]
[2.2999999999999998,"Trust Boards to assure themselves that at least 10 out of 11 Clinical Quality Improvement Metrics (CQIMs) have passed the associated data quality criteria on the national Maternity Services Dashboard for data submissions relating to activity in July 2023. ","CQIMDQ10\nCQIMDQ11\nCQIMDQ12\nCQIMDQ13\nSee metadata file for full construction","CQIMPPH"]
[2.4,"Trust Boards to assure themselves that at least 10 out of 11 Clinical Quality Improvement Metrics (CQIMs) have passed the associated data quality criteria on the national Maternity Services Dashboard for data submissions relating to activity in July 2023. ","CQIMDQ09\nCQIMDQ22\nCQIMDQ23\nSee metadata file for full construction","CQIMPreterm"]
[2.5,"Trust Boards to assure themselves that at least 10 out of 11 Clinical Quality Improvement Metrics (CQIMs) have passed the associated data quality criteria on the national Maternity Services Dashboard for data submissions relating to activity in July 2023. ","CQIMDQ30\nCQIMDQ31\nCQIMDQ32\nCQIMDQ33\nCQIMDQ34\nCQIMDQ36\nCQIMDQ37\nCQIMDQ38\nCQIMDQ39\nSee metadata file for full construction","CQIMRobson1"]
[2.6,"Trust Boards to assure themselves that at least 10 out of 11 Clinical Quality Improvement Metrics (CQIMs) have passed the associated data quality criteria on the national Maternity Services Dashboard for data submissions relating to activity in July 2023. ","CQIMDQ30\nCQIMDQ31\nCQIMDQ32\nCQIMDQ33\nCQIMDQ34\nCQIMDQ36\nCQIMDQ37\nCQIMDQ38\nCQIMDQ39\nSee metadata file for full construction","CQIMRobson2"]
[2.7,"Trust Boards to assure themselves that at least 10 out of 11 Clinical Quality Improvement Metrics (CQIMs) have passed the associated data quality criteria on the national Maternity Services Dashboard for data submissions relating to activity in July 2023. ","CQIMDQ30\nCQIMDQ31\nCQIMDQ32\nCQIMDQ33\nCQIMDQ34\nCQIMDQ36\nCQIMDQ37\nCQIMDQ38\nCQIMDQ39\nSee metadata file for full construction","CQIMRobson5"]
{"$rows_left_out":8}